{"text_format":"1","workbook":"xlsx","n_sheets":3,"sheets":["Notes Balance","Cumulative Defaults","Collateral Tables"],"not_rendered":{"charts":1,"images":0,"macros":1,"external_links":7,"defined_names":24,"comments":2,"pivot_tables":0},"unopened":[],"bounds":{"document_bytes":16777216,"sheet_cells":100000,"rows_first":2000,"rows_last":500,"rows_between":2000,"halvings":0,"cell_chars":16384,"cell_head_chars":4096},"cells_cut":0,"cells_raw":0,"read":"whole","date_system":"1900"}

{"sheet":"Notes Balance","index":0,"n_rows":203,"n_cols":6,"rows_kept":203,"cut":false,"hidden":false,"merged":[]}
["TOTAL NOTE BALANCES"]
[null,"Total Notes","Class A1 Notes","Class A2 Notes","Class B Notes","Class C Notes"]
["Initial Invested Amount",{"$f":"SUM(C3:F3)","v":408900000},189325000,200000000,10875000,8700000]
["Invested Amount as at Previous Payment Date:  17 August 2020",{"$f":"SUM(C4:F4)","v":408900000},189325000,200000000,10875000,8700000]
["Stated Amount as at Previous Payment Date:  17 August 2020",408900000,189325000,200000000,10875000,8700000]
["Principal Payments to Noteholders on Payment Date",34777204.240000002,34777204.240000002,0,0,0]
["Gross Aggregate Charge-Offs",{"$f":"SUM(C7:G7)","v":0},0,0,0,0]
["Gross Aggregate Reinstatements of charge-offs",0,0,0,0,0]
["Aggregate Charge-Offs for this Collection Period",0,0,0,0,0]
["Reinstatements relating to Charge-offs that have occurred this Collection Period",0,0,0,0,0]
["Aggregate Carry Over Charge-offs not previously reinstated",0,0,0,0,0]
["Reinstatements of Carry Over Charge-offs not previously reinstated",0,0,0,0,0]
["Aggregate Charge-Offs not reinstated and to be carried over to next period",0,0,0,0,0]
["Invested Amount as at Payment Date:  16 November 2020",374122795.75999999,154547795.75999999,200000000,10875000,8700000]
["Stated Amount as at Payment Date:  16 November 2020",374122795.75999999,154547795.75999999,200000000,10875000,8700000]
["Bond Factor at Payment Date:  16 November 2020",null,0.8163094982701703,1,1,1]
["Coupon Margin",null,9.4999999999999998E-3,1.0999999999999999E-2,0,0]
["Coupon Rate (3 month BBSW + margin)",null,1.0499999999999999E-2,1.2E-2,1E-3,1E-3]
["Days in Coupon Period",null,91,91,91,91]
["Coupon Entitlement to be paid out on the current Payment Date: 16 November 2020",null,495616.54,598356.16,2711.3,2169.04]
[]
[]
[]
["TOTAL NOTE BALANCES"]
[null,"Total Notes","Class A1 Notes","Class A2 Notes","Class B Notes","Class C Notes"]
["Initial Invested Amount",{"$f":"SUM(C26:G26)","v":408900000},189325000,200000000,10875000,8700000]
["Invested Amount as at Previous Payment Date:  16 November 2020",{"$f":"SUM(C27:G27)","v":374122795.75999999},154547795.75999999,200000000,10875000,8700000]
["Stated Amount as at Previous Payment Date:  16 November 2020",374122795.75999999,154547795.75999999,200000000,10875000,8700000]
["Principal Payments to Noteholders on Payment Date",28459951.68,28459951.68,0,0,0]
["Gross Aggregate Charge-Offs",0,0,0,0,0]
["Gross Aggregate Reinstatements of charge-offs",0,0,0,0,0]
["Aggregate Charge-Offs for this Collection Period",0,0,0,0,0]
["Reinstatements relating to Charge-offs that have occurred this Collection Period",{"$f":"SUM(C33:G33)","v":0},0,0,0,0]
["Aggregate Carry Over Charge-offs not previously reinstated",0,0,0,0,0]
["Reinstatements of Carry Over Charge-offs not previously reinstated",0,0,0,0,0]
["Aggregate Charge-Offs not reinstated and to be carried over to next period",0,0,0,0,0]
["Invested Amount as at Payment Date:  16 February 2021",345662844.07999998,126087844.07999998,200000000,10875000,8700000]
["Stated Amount as at Payment Date:  16 February 2021",345662844.07999998,126087844.07999998,200000000,10875000,8700000]
["Bond Factor at Payment Date:  16 February 2021",null,0.66598623573220639,1,1,1]
["Coupon Margin",null,9.4999999999999998E-3,1.0999999999999999E-2,0,0]
["Coupon Rate (3 month BBSW + margin)",null,9.7000000000000003E-3,1.12E-2,2.0000000000000001E-4,2.0000000000000001E-4]
["Days in Coupon Period",null,92,92,92,92]
["Coupon Entitlement to be paid out on the current Payment Date: 16 February 2021",null,377858.78,564602.74,548.22,438.58]
[]
[]
[]
["TOTAL NOTE BALANCES"]
[null,"Total Notes","Class A1 Notes","Class A2 Notes","Class B Notes","Class C Notes"]
["Initial Invested Amount",{"$f":"SUM(C49:F49)","v":408900000},189325000,200000000,10875000,8700000]
["Invested Amount as at Previous Payment Date:  16 February 2021",{"$f":"SUM(C50:F50)","v":345662844.07999998},126087844.07999998,200000000,10875000,8700000]
["Stated Amount as at Previous Payment Date:  16 February 2021",345662844.07999998,126087844.07999998,200000000,10875000,8700000]
["Principal Payments to Noteholders on Payment Date",62919663.530000001,62919663.530000001,0,0,0]
["Gross Aggregate Charge-Offs",0,{"$f":"+D53","v":0},0,0,0]
["Gross Aggregate Reinstatements of charge-offs",0,0,0,0,0]
["Aggregate Charge-Offs for this Collection Period",0,0,0,0,0]
["Reinstatements relating to Charge-offs that have occurred this Collection Period",0,0,0,0,0]
["Aggregate Carry Over Charge-offs not previously reinstated",0,0,0,0,0]
["Reinstatements of Carry Over Charge-offs not previously reinstated",0,0,0,0,0]
["Aggregate Charge-Offs not reinstated and to be carried over to next period",{"$f":"SUM(C59:F59)","v":0},0,0,0,0]
["Invested Amount as at Payment Date:  17 May 2021",{"$f":"SUM(C60:F60)","v":282743180.54999995},63168180.549999982,200000000,10875000,8700000]
{"$rows_left_out":144}
{"sheet":"Cumulative Defaults","index":1,"n_rows":12,"n_cols":4,"rows_kept":12,"cut":false,"hidden":false,"merged":[]}
["Cumulative Defaults & Losses"]
[]
["Month","Gross Losses","Recoveries","Net Losses"]
["2020-10-01",0,0,{"$f":"+B4-C4","v":0}]
["2021-01-01",0,0,0]
["2021-04-01",4.1450255172413797E-4,0,4.1450255172413797E-4]
["2021-07-01",2.1661076551724137E-3,4.4360710344827588E-4,1.7225005517241378E-3]
["2021-10-01",2.1661076551724137E-3,6.0579639080459769E-4,1.560311264367816E-3]
["2022-01-01",2.1661076551724137E-3,1.7826673793103448E-3,3.8344027586206895E-4]
["2022-04-01",2.1661076551724137E-3,1.7826673793103448E-3,3.8344027586206895E-4]
["2022-07-01",2.3516720689655173E-3,1.7826673793103448E-3,5.690046896551725E-4]
["2022-10-01",{"$f":"+B11+'Collateral Tables'!E9/'Collateral Tables'!AK6","v":2.3516720689655173E-3},{"$f":"+C11+'Collateral Tables'!E23/'Collateral Tables'!AK6","v":1.940661119451735E-3},4.1101094951378233E-4]

{"sheet":"Collateral Tables","index":2,"n_rows":247,"n_cols":39,"rows_kept":247,"cut":false,"hidden":false,"merged":[]}
[null,"CNHI CAPITAL AUSTRALIA RECEIVABLES TRUST SERIES 2020-1 (TERM DEAL)"]
[null,"COLLATERAL DATA TABLES"]
[]
[null,"OUTSTANDING RECEIVABLES",null,null,"2022-10-31",null,null,null,"2022-07-31",null,null,null,"2022-04-30",null,null,null,"2022-01-31",null,null,null,"2021-10-31",null,null,null,"2021-07-31",null,null,null,"2021-04-30",null,null,null,"2021-01-31",null,null,null,"2020-10-31"]
[]
[null,"Opening Balance",null,null,{"$f":"I13","v":166602763.96000147},null,null,null,188292626.03000146,null,null,null,241929849.88000146,null,null,null,266150764.45000145,null,null,null,285706597.29000145,null,null,null,308843180.5500015,null,null,null,371762844.08000153,null,null,null,400222795.76000142,null,null,null,434999973.20000142]
[null,"Principal Repayments - Scheduled",null,null,{"$f":"MIN(([2]Sheet1!$B$3+[3]Sheet1!$B$3+[4]Sheet1!$B$3),'[1]16 Nov 22'!$H$23)","v":10802142.240000002},null,null,null,15186705.529999997,null,null,null,50368331.030000009,null,null,null,20483625.579999998,null,null,null,13474555.289999999,null,null,null,18901918.629999992,null,null,null,59828601.879999973,null,null,null,25136419.830000006,null,null,null,26305441.499999996]
[null,"Principal Repayments - Unscheduled",null,null,{"$f":"'[1]16 Nov 22'!$H$23-'Collateral Tables'!E7","v":5036221.1100000124},null,null,null,6422436.0199999772,null,null,null,3268892.8200000003,null,null,null,3737288.9899999909,null,null,null,6081277.5499999784,null,null,null,3472716.4100000151,null,null,null,2910753.0400000513,null,null,null,3323531.8499999158,null,null,null,8471735.9399999939]
[{"$f":"SUM(E9:AK9)","v":1022977.35},"Charge-Offs",null,null,{"$f":"'[1]16 Nov 22'!$H$37","v":0},null,null,null,80720.52,null,null,null,0,null,null,null,0,null,null,null,0,null,null,null,761948.22,null,null,null,180308.61000000002,null,null,null,0,null,null,null,0]
[null,"Reinstatements"]
[null,"New Receivables Purchased"]
[null,"Non Cash Change in Receivables"]
[null,"Closing Balance",null,null,{"$f":"E6-E7-E8-E9+E10+E11-E12","v":150764400.61000144},null,null,null,166602763.96000147,null,null,null,188292626.03000146,null,null,null,241929849.88000146,null,null,null,266150764.45000145,null,null,null,285706597.29000145,null,null,null,308843180.5500015,null,null,null,371762844.08000153,null,null,null,400222795.76000142]
[]
[null,"PORTFOLIO STATISTICS"]
[]
[null,"Summary"]
[null,"Number of contracts",null,null,{"$f":"[5]Summary!$B$4","v":2239},null,null,null,2430,null,null,null,2592,null,null,null,2793,null,null,null,2936,null,null,null,3089,null,null,null,3260,null,null,null,3379,null,null,null,3459]
[null,"Dollar value of contracts",null,null,{"$f":"[5]Summary!$B$5","v":150764400.61000022},null,null,null,166602763.95999995,null,null,null,188292626.03000048,null,null,null,241929849.88000008,null,null,null,266150764.45000002,null,null,null,285706597.29000068,null,null,null,308843180.5499993,null,null,null,371762844.08000028,null,null,null,400222795.76000023]
[null,"Number of contracts closed during the Quarter",null,null,{"$f":"[5]Summary!$B$19","v":191},null,null,null,161,null,null,null,201,null,null,null,143,null,null,null,153,null,null,null,169,null,null,null,118,null,null,null,80,null,null,null,81]
[null,"Dollar value of contracts closed during the Quarter",null,null,{"$f":"[5]Summary!$B$20","v":6635912.9899999946},null,null,null,9288138.5500000007,null,null,null,10682698.570000004,null,null,null,6966650.9299999969,null,null,null,6913033.9500000002,null,null,null,6346762.1999999993,null,null,null,8489230.9399999958,null,null,null,6207942.7200000016,null,null,null,11089284.780000003]
[]
[{"$f":"SUM(E23:AK23)","v":844187.58272727265},"Dollar Value of Recoveries from Collateral",null,null,{"$f":"[5]Summary!$C$16","v":68727.272727272721},null,null,null,0,null,null,null,0,null,null,null,511938.88,null,null,null,70552.34,null,null,null,192969.09,null,null,null,0,null,null,null,0,null,null,null,0]
[{"$f":"SUM(E24:AK24)","v":0},"Dollar Value of Recoveries from Other Sources",null,null,0,null,null,null,0,null,null,null,0,null,null,null,0,null,null,null,0,null,null,null,0,null,null,null,0,null,null,null,0,null,null,null,0]
[]
[null,"Average Term of Contracts (Months)",null,null,{"$f":"[6]Sheet1!$W$2241","v":57.539147174671996},null,null,null,57.191778717654792,null,null,null,57.003507709271041,null,null,null,56.280947822245622,null,null,null,55.944761230949652,null,null,null,55.739992390288997,null,null,null,55.455838893218491,null,null,null,54.836712581510767,null,null,null,54.458787730372293]
[null,"Average Term to Maturity (Months)",null,null,{"$f":"[6]Sheet1!$X$2241","v":20.966472612967284},null,null,null,23.39658322803011,null,null,null,25.878032664771723,null,null,null,27.427995236682662,null,null,null,29.925021901134734,null,null,null,32.574078748533445,null,null,null,34.945628768910865,null,null,null,36.785248881480932,null,null,null,39.320110754577776]
[null,"Average Residual / Balloon Payment *",null,null,{"$f":"[6]Sheet1!$AI$2241","v":3.9951402400772142E-2},null,null,null,4.007721012764081E-2,null,null,null,4.2996078134734717E-2,null,null,null,3.8032173994578866E-2,null,null,null,3.7283129157290783E-2,null,null,null,3.7181210890735616E-2,null,null,null,3.8809459520592636E-2,null,null,null,3.738139172226735E-2,null,null,null,3.7554148495446298E-2]
[null,"Average Seasoning (Months)",null,null,{"$f":"E26-E27","v":36.572674561704716},null,null,null,33.795195489624682,null,null,null,31.125475044499318,null,null,null,28.85295258556296,null,null,null,26.019739329814918,null,null,null,23.165913641755552,null,null,null,20.510210124307626,null,null,null,18.051463700029835,null,null,null,15.138676975794517]
[null,"Average Dollar Value of Individual Assets",null,null,{"$f":"E19/E18","v":67335.596520768304},null,null,null,68560.808213991753,null,null,null,72643.760042438458,null,null,null,86620.067984246358,null,null,null,90650.805330381481,null,null,null,92491.614532211286,null,null,null,94737.171947852548,null,null,null,110021.55788102998,null,null,null,115704.76893899978]
[null,"Weighted Average Interest Rate",null,null,{"$f":"[6]Sheet1!$AA$2241/100","v":2.2490175775185306E-2},null,null,null,2.2499087080788023E-2,null,null,null,2.256194558015907E-2,null,null,null,2.2640530719373553E-2,null,null,null,2.2672279528860875E-2,null,null,null,2.270699088694228E-2,null,null,null,2.2731504735293059E-2,null,null,null,2.2726608213105511E-2,null,null,null,2.2793137532541325E-2]
[]
[null,"Payment in Arrears"]
["1. 0 - 30 Days","0 - 30 Days",null,null,{"$f":"IFERROR(VLOOKUP($A34,'[7]Arrears Reporting'!$A$1:$D$8,3,FALSE),0)","v":2235},{"$f":"IFERROR(VLOOKUP($A34,'[7]Arrears Reporting'!$A$1:$D$8,2,FALSE),0)","v":7595.869999999999},{"$f":"F34/F$50","v":5.0382384497047929E-5},null,2430,12445.270000000008,7.4700261293312169E-5,null,2586,27763.280000000006,1.474475160571424E-4,null,2789,221564.44999999998,9.1582105354051364E-4,null,2931,46557.440000000002,1.7492882312854092E-4,null,3088,1243.8200000000038,4.3534871500971666E-6,null,3244,96795.249999999985,3.1341229496349406E-4,null,3368,669139.2699999999,1.7999089490933814E-3,null,3448,608582.11,1.5206083122885025E-3]
["2. 31 - 60 Days","31 - 60 Days",null,null,{"$f":"IFERROR(VLOOKUP($A35,'[7]Arrears Reporting'!$A$1:$D$8,3,FALSE),0)","v":3},{"$f":"IFERROR(VLOOKUP($A35,'[7]Arrears Reporting'!$A$1:$D$8,2,FALSE),0)","v":63443.54},4.2081247126844469E-4,null,0,0,0,null,5,235579.35,1.251134231685023E-3,null,3,49823.040000000008,2.0594002775892596E-4,null,1,6263.1599999999817,2.3532376519536921E-5,null,1,31314.589999999989,1.0960401438758081E-4,null,10,74360.209999999992,2.4077012115850065E-4,null,3,77257.799999999988,2.0781474327051026E-4,null,8,239593.93000000002,5.9865138252563753E-4]
["3. 61 - 90 Days","61 - 90 Days",null,null,{"$f":"IFERROR(VLOOKUP($A36,'[7]Arrears Reporting'!$A$1:$D$8,3,FALSE),0)","v":1},{"$f":"IFERROR(VLOOKUP($A36,'[7]Arrears Reporting'!$A$1:$D$8,2,FALSE),0)","v":2106.399999999996},1.3971468008876083E-5,null,0,0,0,null,1,79563,4.2254973908178062E-4,null,1,3126.3600000000024,1.2922588930430503E-5,null,3,117643.13000000002,4.4201687807701511E-4,null,0,0,0,null,2,37814.990000000005,1.224407478664664E-4,null,4,131816.78000000003,3.5457222823385265E-4,null,2,134580.25,3.3626332988964257E-4]
["4. 91 - 120 Days","91 - 120 Days",null,null,{"$f":"IFERROR(VLOOKUP($A37,'[7]Arrears Reporting'!$A$1:$D$8,3,FALSE),0)","v":0},{"$f":"IFERROR(VLOOKUP($A37,'[7]Arrears Reporting'!$A$1:$D$8,2,FALSE),0)","v":0},0,null,0,0,0,null,0,0,0,null,0,0,0,null,0,0,0,null,0,0,0,null,2,115620.04999999999,3.7436491164901097E-4,null,2,41551.660000000003,1.1176926543809858E-4,null,1,5840.8499999999985,1.459399629875794E-5]
["5. 121 - 150 Days","121 - 150 Days",null,null,{"$f":"IFERROR(VLOOKUP($A38,'[7]Arrears Reporting'!$A$1:$D$8,3,FALSE),0)","v":0},{"$f":"IFERROR(VLOOKUP($A38,'[7]Arrears Reporting'!$A$1:$D$8,2,FALSE),0)","v":0},0,null,0,0,0,null,0,0,0,null,0,0,0,null,0,0,0,null,0,0,0,null,0,0,0,null,2,3518.8499999999995,9.4653084783340328E-6,null,0,0,0]
["6. 151 - 180 Days","151 - 180 Days",null,null,{"$f":"IFERROR(VLOOKUP($A39,'[7]Arrears Reporting'!$A$1:$D$8,3,FALSE),0)","v":0},{"$f":"IFERROR(VLOOKUP($A39,'[7]Arrears Reporting'!$A$1:$D$8,2,FALSE),0)","v":0},0,null,0,0,0,null,0,0,0,null,0,0,0,null,1,8526.9999999999836,3.2038232231348315E-5,null,0,0,0,null,2,122531.52000000002,3.9674348574506789E-4,null,0,0,0,null,0,0,0]
[null,"Total",null,null,{"$f":"SUM(E34:E39)","v":2239},{"$f":"SUM(F34:F39)","v":73145.81},{"$f":"SUM(G34:G39)","v":4.8516632377436868E-4},null,2430,12445.270000000008,7.4700261293312169E-5,null,2592,342905.63,1.8211314868239459E-3,null,2793,274513.84999999998,1.1346836702298701E-3,null,2936,178990.72999999998,6.7251630995644122E-4,null,3089,32558.409999999993,1.1395750153767797E-4,null,3260,447122.01999999996,1.4477315613825399E-3,null,3379,923284.35999999987,2.4835304945141769E-3,null,3459,988597.14,2.4701170210025408E-3]
[null,"* Expressed as a % of Aggreg. Rec. closing bal.",null,null,null,"> 30 days",{"$f":"SUM(G35:G39)","v":4.3478393927732074E-4},null,null,"> 30 days",0,null,null,"> 30 days",1.6736839707668038E-3,null,null,"> 30 days",2.1886261668935646E-4,null,null,"> 30 days",4.9758748682790033E-4,null,null,"> 30 days",1.0960401438758081E-4,null,null,"> 30 days",1.1343192664190458E-3,null,null,"> 30 days",6.8362154542079548E-4,null,null,"> 30 days",9.4950870871403803E-4]
[]
[" 0 - 30 Days","Account Balances in Arrears"]
["1. 0 - 30 Days","0 - 30 Days",null,null,{"$f":"IFERROR(VLOOKUP($A44,'[7]Arrears Reporting'!$A$1:$D$8,3,FALSE),0)","v":2235},{"$f":"IFERROR(VLOOKUP($A44,'[7]Arrears Reporting'!$A$1:$D$8,4,FALSE),0)","v":150527300.33000022},{"$f":"F44/F$50","v":0.99842734571927672},null,2430,166602763.95999995,1,null,2586,187285532.26000047,0.9946514433877004,null,2789,241635939.44000009,0.99878514189073497,null,2931,265617550.49000001,0.99799657175097034,null,3088,285598376.65000069,0.99962121756715983,null,3244,306751454.69999921,0.99322722345277326,null,3368,370345507.02000022,0.99618752362542429,null,3448,398525593.33000022,0.99575935591880238]
["2. 31 - 60 Days","31 - 60 Days",null,null,{"$f":"IFERROR(VLOOKUP($A45,'[7]Arrears Reporting'!$A$1:$D$8,3,FALSE),0)","v":3},{"$f":"IFERROR(VLOOKUP($A45,'[7]Arrears Reporting'!$A$1:$D$8,4,FALSE),0)","v":181481.40999999997},{"$f":"F45/F$50","v":1.2037417935913067E-3},null,0,0,0,null,5,927530.77,4.9260068732177404E-3,null,3,244087.31999999998,1.0089177508317804E-3,null,1,186406.88999999996,7.0038081756108959E-4,null,1,108220.64,3.787824328401939E-4,null,10,955937.27,3.0952189661356037E-3,null,3,457915.85,1.231741841047085E-3,null,8,1107284.19,2.7666694694322208E-3]
["3. 61 - 90 Days","61 - 90 Days",null,null,{"$f":"IFERROR(VLOOKUP($A46,'[7]Arrears Reporting'!$A$1:$D$8,3,FALSE),0)","v":1},{"$f":"IFERROR(VLOOKUP($A46,'[7]Arrears Reporting'!$A$1:$D$8,4,FALSE),0)","v":55618.869999999995},3.6891248713199733E-4,null,0,0,0,null,1,79563,4.2254973908178062E-4,null,1,49823.119999999995,2.0594035843329305E-4,null,3,338296.19,1.2710697664126136E-3,null,0,0,0,null,2,219395.31,7.1037770563459697E-4,null,4,653099.60000000009,1.756764051061161E-3,null,2,543586.31000000006,1.3582092668353904E-3]
["4. 91 - 120 Days","91 - 120 Days",null,null,{"$f":"IFERROR(VLOOKUP($A47,'[7]Arrears Reporting'!$A$1:$D$8,3,FALSE),0)","v":0},{"$f":"IFERROR(VLOOKUP($A47,'[7]Arrears Reporting'!$A$1:$D$8,4,FALSE),0)","v":0},{"$f":"F47/F$50","v":0},null,0,0,0,null,0,0,0,null,0,0,0,null,0,0,0,null,0,0,0,null,2,348198.83,1.1274292324665058E-3,null,2,222711.15999999997,5.9906782925319552E-4,null,1,46331.93,1.1576534492998659E-4]
["5. 121 - 150 Days","121 - 150 Days",null,null,{"$f":"IFERROR(VLOOKUP($A48,'[7]Arrears Reporting'!$A$1:$D$8,3,FALSE),0)","v":0},{"$f":"IFERROR(VLOOKUP($A48,'[7]Arrears Reporting'!$A$1:$D$8,4,FALSE),0)","v":0},{"$f":"F48/F$50","v":0},null,0,0,0,null,0,0,0,null,0,0,0,null,0,0,0,null,0,0,0,null,0,0,0,null,2,83610.45,2.2490265321406817E-4,null,0,0,0]
["6. 151 - 180 Days","151 - 180 Days",null,null,{"$f":"IFERROR(VLOOKUP($A49,'[7]Arrears Reporting'!$A$1:$D$8,3,FALSE),0)","v":0},{"$f":"IFERROR(VLOOKUP($A49,'[7]Arrears Reporting'!$A$1:$D$8,4,FALSE),0)","v":0},{"$f":"F49/F$50","v":0},null,0,0,0,null,0,0,0,null,0,0,0,null,1,8510.8799999999901,3.1977665056073413E-5,null,0,0,0,null,2,568194.43999999994,1.8397506429902017E-3,null,0,0,0,null,0,0,0]
[null,"Total",null,null,{"$f":"SUM(E44:E49)","v":2239},{"$f":"SUM(F44:F49)","v":150764400.61000022},{"$f":"SUM(G44:G49)","v":1},null,2430,166602763.95999995,1,null,2592,188292626.03000048,0.99999999999999989,null,2793,241929849.88000008,1,null,2936,266150764.44999999,1.0000000000000002,null,3089,285706597.29000068,1,null,3260,308843180.54999918,1.0000000000000002,null,3379,371762844.08000028,0.99999999999999989,null,3459,400222795.76000023,1]
["NSW",null,null,null,null,"> 30 days",{"$f":"SUM(G45:G49)","v":1.5726542807233041E-3},null,null,"> 30 days",0,null,null,"> 30 days",5.348556612299521E-3,null,null,"> 30 days",1.2148581092650734E-3,null,null,"> 30 days",2.0034282490297766E-3,null,null,"> 30 days",3.787824328401939E-4,null,null,"> 30 days",6.7727765472269091E-3,null,null,"> 30 days",3.8124763745755099E-3,null,null,"> 30 days",4.2406440811975981E-3]
[null,null,null,null,null,"> 60 days",{"$f":"SUM(G46:G49)","v":3.6891248713199733E-4},null,null,"> 60 days",0,null,null,"> 60 days",4.2254973908178062E-4,null,null,"> 60 days",2.0594035843329305E-4,null,null,"> 60 days",1.3030474314686871E-3,null,null,"> 60 days",0,null,null,"> 60 days",3.6775575810913045E-3,null,null,"> 60 days",2.5807345335284249E-3,null,null,"> 60 days",1.4739746117653769E-3]
[null,null,null,null,null,">90 days",{"$f":"SUM(G47:G49)","v":0},null,null,">90 days",0,null,null,">90 days",0,null,null,">90 days",0,null,null,">90 days",3.1977665056073413E-5,null,null,">90 days",0,null,null,">90 days",2.9671798754567075E-3,null,null,">90 days",8.2397048246726366E-4,null,null,">90 days",1.1576534492998659E-4]
[]
["VIC","Geographic Distribution"]
["NSW","New South Wales",null,null,{"$f":"F56/F$64","v":0.23626372980543894},{"$f":"IFERROR(VLOOKUP($A56,'[7]Geographic '!$A$1:$C$10,3,FALSE),0)","v":35620159.609999992},null,null,0.24313699429215649,40507295.270000003,null,null,0.24703485713024639,46514841.969999947,null,null,0.24196307648285476,58538090.769999988,null,null,0.24479149317731752,65151443.040000044,null,null,0.24627373986950885,70362032.219999984,null,null,0.24998360631602445,77205732.060000047,null,null,0.24533885742592679,91207871.400000185,null,null,0.24685968916984516,98798874.960000023]
["VIC","Victoria",null,null,{"$f":"F57/F$64","v":0.2232029986113841},{"$f":"IFERROR(VLOOKUP($A57,'[7]Geographic '!$A$1:$C$10,3,FALSE),0)","v":33651066.299999982},null,null,0.22540649697154036,37553345.409999982,null,null,0.2322001169235062,43721569.780000016,null,null,0.22140066774136413,53563430.309999965,null,null,0.21604185664776496,57499705.299999982,null,null,0.2171302887592485,62035555.970000029,null,null,0.22236335990226544,68675407.309999987,null,null,0.21677229686422927,80587885.599999949,null,null,0.21323032049672458,85339635.009999946]
["QLD","Queensland",null,null,9.4625724324033531E-2,{"$f":"IFERROR(VLOOKUP($A58,'[7]Geographic '!$A$1:$C$10,3,FALSE),0)","v":14266190.610000011},null,null,0.10122824555329192,16864905.500000007,null,null,0.1132464900489655,21323478.99999997,null,null,0.10112905555943383,24466137.229999997,null,null,0.10442232017417749,27792080.340000007,null,null,0.11230010435297356,32084880.689999998,null,null,0.11639922868292057,35949107.99999997,null,null,0.10566504901051051,39282339.139999978,null,null,0.10911006482545886,43668335.189999983]
["SA","South Australia",null,null,0.22370130722864426,{"$f":"IFERROR(VLOOKUP($A59,'[7]Geographic '!$A$1:$C$10,3,FALSE),0)","v":33726193.500000007},null,null,0.21478899520893638,35784440.269999988,null,null,0.20759782952823694,39089140.479999997,null,null,0.21680859917044995,52452471.850000031,null,null,0.20961517463715862,55789238.970000044,null,null,0.20569304985403983,58767861.360000052,null,null,0.19970919351419694,61678822.510000005,null,null,0.20647734487818203,76760604.969999984,null,null,0.2000584061883722,80067934.640000001]
["NT","Northern Territory",null,null,0,{"$f":"IFERROR(VLOOKUP($A60,'[7]Geographic '!$A$1:$C$10,3,FALSE),0)","v":0},null,null,0,0,null,null,0,0,null,null,0,0,null,null,0,0,null,null,0,0,null,null,0,0,null,null,0,0,null,null,0,0]
{"$rows_left_out":187}